-- The C compiler identification is GNU 7.3.0
-- The CXX compiler identification is GNU 7.3.0
-- Check for working C compiler: /builder/arm_cortex-a5_neon-vfpv4/build/sdk/staging_dir/toolchain-arm_cortex-a5+neon-vfpv4_gcc-7.3.0_musl_eabi/bin/arm-openwrt-linux-muslgnueabi-gcc
-- Check for working C compiler: /builder/arm_cortex-a5_neon-vfpv4/build/sdk/staging_dir/toolchain-arm_cortex-a5+neon-vfpv4_gcc-7.3.0_musl_eabi/bin/arm-openwrt-linux-muslgnueabi-gcc -- works
-- Detecting C compiler ABI info
-- Detecting C compiler ABI info - done
-- Detecting C compile features
-- Detecting C compile features - done
-- Check for working CXX compiler: /builder/arm_cortex-a5_neon-vfpv4/build/sdk/staging_dir/toolchain-arm_cortex-a5+neon-vfpv4_gcc-7.3.0_musl_eabi/bin/arm-openwrt-linux-muslgnueabi-g++
-- Check for working CXX compiler: /builder/arm_cortex-a5_neon-vfpv4/build/sdk/staging_dir/toolchain-arm_cortex-a5+neon-vfpv4_gcc-7.3.0_musl_eabi/bin/arm-openwrt-linux-muslgnueabi-g++ -- works
-- Detecting CXX compiler ABI info
-- Detecting CXX compiler ABI info - done
-- Detecting CXX compile features
-- Detecting CXX compile features - done
-- Found OpenSSL: /builder/arm_cortex-a5_neon-vfpv4/build/sdk/staging_dir/target-arm_cortex-a5+neon-vfpv4_musl_eabi/usr/lib/libcrypto.so (found version "1.0.2s") 
-- Found PkgConfig: /builder/arm_cortex-a5_neon-vfpv4/build/sdk/staging_dir/host/bin/pkg-config (found version "0.29.2") 
-- Looking for lws_config.h
-- Looking for lws_config.h - found
-- Checking for module 'json-c'
--   Found json-c, version 0.12.1
-- Found JSON-C: /builder/arm_cortex-a5_neon-vfpv4/build/sdk/staging_dir/target-arm_cortex-a5+neon-vfpv4_musl_eabi/usr/lib/libjson-c.so  
-- Configuring done
-- Generating done
CMake Warning:
  Manually-specified variables were not used by the project:

    CMAKE_ASM_COMPILER
    CMAKE_ASM_COMPILER_ARG1
    CMAKE_MODULE_LINKER_FLAGS
    CMAKE_SHARED_LINKER_FLAGS
    DL_LIBRARY


-- Build files have been written to: /builder/arm_cortex-a5_neon-vfpv4/build/sdk/build_dir/target-arm_cortex-a5+neon-vfpv4_musl_eabi/ttyd-1.4.0
make[4]: Entering directory '/builder/arm_cortex-a5_neon-vfpv4/build/sdk/build_dir/target-arm_cortex-a5+neon-vfpv4_musl_eabi/ttyd-1.4.0'
make[5]: Entering directory '/builder/arm_cortex-a5_neon-vfpv4/build/sdk/build_dir/target-arm_cortex-a5+neon-vfpv4_musl_eabi/ttyd-1.4.0'
make[6]: Entering directory '/builder/arm_cortex-a5_neon-vfpv4/build/sdk/build_dir/target-arm_cortex-a5+neon-vfpv4_musl_eabi/ttyd-1.4.0'
[ 16%] Generating html.h from index.html
/bin/sh: 1: CMAKE_XXD-NOTFOUND: not found
CMakeFiles/ttyd.dir/build.make:61: recipe for target 'html.h' failed
make[6]: *** [html.h] Error 127
make[6]: Leaving directory '/builder/arm_cortex-a5_neon-vfpv4/build/sdk/build_dir/target-arm_cortex-a5+neon-vfpv4_musl_eabi/ttyd-1.4.0'
CMakeFiles/Makefile2:67: recipe for target 'CMakeFiles/ttyd.dir/all' failed
make[5]: *** [CMakeFiles/ttyd.dir/all] Error 2
make[5]: Leaving directory '/builder/arm_cortex-a5_neon-vfpv4/build/sdk/build_dir/target-arm_cortex-a5+neon-vfpv4_musl_eabi/ttyd-1.4.0'
Makefile:151: recipe for target 'all' failed
make[4]: *** [all] Error 2
make[4]: Leaving directory '/builder/arm_cortex-a5_neon-vfpv4/build/sdk/build_dir/target-arm_cortex-a5+neon-vfpv4_musl_eabi/ttyd-1.4.0'
Makefile:47: recipe for target '/builder/arm_cortex-a5_neon-vfpv4/build/sdk/build_dir/target-arm_cortex-a5+neon-vfpv4_musl_eabi/ttyd-1.4.0/.built' failed
make[3]: *** [/builder/arm_cortex-a5_neon-vfpv4/build/sdk/build_dir/target-arm_cortex-a5+neon-vfpv4_musl_eabi/ttyd-1.4.0/.built] Error 2
time: package/feeds/packages/ttyd/compile#0.98#0.52#3.19